BDBM50092342 CHEMBL3586111
SMILES [H][C@@]12CC[C@](C)(O)[C@@H](O)[C@@]1([H])c1c(O)cc(CCCCC)cc1OC2(C)C
InChI Key InChIKey=TZGCTXUTNDNTTE-DYZHCLJRSA-N
Data  2 KI
  Tab Delimited (TSV)   2D SDfile   Computed 3D by Vconf -m prep SDfile
Find this compound or compounds like it in BindingDB:
Activity Spreadsheet -- Enzyme Inhibition Constant Data from BindingDB
Found 1 hit for monomerid = 50092342
TargetCannabinoid receptor 2(Homo sapiens (Human))
The University Of Mississippi
Curated by ChEMBL
LigandPNGBDBM50092342(CHEMBL3586111)
Affinity DataKi:  2.14E+3nM. Assay description: Displacement of [3H]CP55940 from full length human recombinant CB2 receptor expressed in HEK293 cells after 90 mins by scintillation counting analysi...
In DepthDetails ArticlePubMed